sphere-n
type: LexicalEntry
canonical form: sphere
sense: 13921592-n
part of speech: noun

13921592-n
type: LexicalConcept
in scheme: en-word.net
definition: a three-dimensional closed surface such that every point on the surface is equidistant from the center
ili: i109979
lexfile: noun.shape
part of speech: noun
hypernym: 13888104-n
mero part: 13634034-n