conformation-n
type: LexicalEntry
canonical form: conformation
sense: 13920900-n
part of speech: noun

13920900-n
type: LexicalConcept
in scheme: en-word.net
definition: a symmetrical arrangement of the parts of a thing
ili: i109975
lexfile: noun.shape
part of speech: noun
hypernym: 13920689-n