caput-n
type: LexicalEntry
canonical form: caput
sense: 13918055-n
part of speech: noun

13918055-n
type: LexicalConcept
in scheme: en-word.net
definition: a headlike protuberance on an organ or structure
example: the caput humeri is the head of the humerus which fits into a cavity in the scapula
ili: i109957
lexfile: noun.shape
part of speech: noun
hypernym: 13917127-n