square-n
type: LexicalEntry
canonical form: square
sense: 13901273-n
part of speech: noun

foursquare-n
type: LexicalEntry
canonical form: foursquare
sense: 13901273-n
part of speech: noun

13901273-n
type: LexicalConcept
in scheme: en-word.net
definition: (geometry) a plane rectangle with four equal sides and four right angles; a four-sided regular polygon
example: you can compute the area of a square if you know the length of its sides
ili: i109860
lexfile: noun.shape
part of speech: noun
domain topic: 06014015-n
hypernym: 13906003-n
hypernym: 13889754-n