spiral-n
type: LexicalEntry
canonical form: spiral
sense: 13899010-n
part of speech: noun

13899010-n
type: LexicalConcept
in scheme: en-word.net
definition: a plane curve traced by a point circling about the center but at increasing distances from the center
ili: i109848
lexfile: noun.shape
part of speech: noun
hypernym: 13890262-n