heart-n
type: LexicalEntry
canonical form: heart
sense: 13888525-n
part of speech: noun

13888525-n
type: LexicalConcept
in scheme: en-word.net
definition: a plane figure with rounded sides curving inward at the top and intersecting at the bottom; conventionally used on playing cards and valentines
example: he drew a heart and called it a valentine
ili: i109791
lexfile: noun.shape
part of speech: noun
hypernym: 13885789-n