competition-n
type: LexicalEntry
canonical form: competition
sense: 13859208-n
part of speech: noun

13859208-n
type: LexicalConcept
in scheme: en-word.net
definition: a business relation in which two parties compete to gain customers
example: business competition can be fiendish at times
ili: i109634
lexfile: noun.relation
part of speech: noun
hypernym: 13859040-n