attitude-n
type: LexicalEntry
canonical form: attitude
sense: 13850556-n
part of speech: noun

13850556-n
type: LexicalConcept
in scheme: en-word.net
definition: position of aircraft or spacecraft relative to a frame of reference (the horizon or direction of motion)
ili: i109573
lexfile: noun.relation
part of speech: noun
hypernym: 13850288-n