orientation-n
type: LexicalEntry
canonical form: orientation
sense: 13850288-n
part of speech: noun

13850288-n
type: LexicalConcept
in scheme: en-word.net
definition: position or alignment relative to points of the compass or other specific directions
ili: i109572
lexfile: noun.relation
part of speech: noun
attribute: https://en-word.net/synset/01235508-a
attribute: https://en-word.net/synset/01236220-a
attribute: https://en-word.net/synset/01237040-a
hypernym: 13849639-n