proportionality-n
type: LexicalEntry
canonical form: proportionality
sense: 13846887-n
part of speech: noun

13846887-n
type: LexicalConcept
in scheme: en-word.net
definition: a ratio of two quantities that is constant
ili: i109553
lexfile: noun.relation
part of speech: noun
hypernym: 13841419-n