rate-n
type: LexicalEntry
canonical form: rate
sense: 13838861-n
part of speech: noun

13838861-n
type: LexicalConcept
in scheme: en-word.net
definition: a quantity or amount or measure considered as a proportion of another quantity or amount or measure
example: the literacy rate
example: the retention rate
example: the dropout rate
ili: i109511
lexfile: noun.relation
part of speech: noun
hypernym: 13837954-n