proportion-n
type: LexicalEntry
canonical form: proportion
sense: 13837954-n
part of speech: noun

13837954-n
type: LexicalConcept
in scheme: en-word.net
definition: the quotient obtained when the magnitude of a part is divided by the magnitude of the whole
ili: i109507
lexfile: noun.relation
part of speech: noun
hypernym: 13847027-n
mero part: 05872503-n