proportion-n
type: LexicalEntry
canonical form: proportion
sense: 13837661-n
part of speech: noun

ratio-n
type: LexicalEntry
canonical form: ratio
sense: 13837661-n
part of speech: noun

13837661-n
type: LexicalConcept
in scheme: en-word.net
definition: the relation between things (or parts of things) with respect to their comparative quantity, magnitude, or degree
example: an inordinate proportion of the book is given over to quotations
example: a dry martini has a large proportion of gin
ili: i109506
lexfile: noun.relation
part of speech: noun
hypernym: 13837364-n