leftover-n
type: LexicalEntry
canonical form: leftover
sense: 13833396-n
part of speech: noun

remnant-n
type: LexicalEntry
canonical form: remnant
sense: 13833396-n
part of speech: noun

13833396-n
type: LexicalConcept
in scheme: en-word.net
definition: a small part or portion that remains after the main part no longer exists
ili: i109482
lexfile: noun.relation
part of speech: noun
hypernym: 13833030-n