alliance-n
type: LexicalEntry
canonical form: alliance
sense: 13814395-n
part of speech: noun

bond-n
type: LexicalEntry
canonical form: bond
sense: 13814395-n
part of speech: noun

13814395-n
type: LexicalConcept
in scheme: en-word.net
definition: a connection based on kinship or marriage or common interest
example: the shifting alliances within a large family
example: their friendship constitutes a powerful bond between them
ili: i109385
lexfile: noun.relation
part of speech: noun
hypernym: 13813601-n