series-n
type: LexicalEntry
canonical form: series
sense: 13814122-n
part of speech: noun

13814122-n
type: LexicalConcept
in scheme: en-word.net
definition: (electronics) connection of components in such a manner that current flows first through one and then through the other
example: the voltage divider consisted of a series of fixed resistors
ili: i109384
lexfile: noun.relation
part of speech: noun
domain topic: 06108876-n
hypernym: 13813601-n