reflection-n
type: LexicalEntry
canonical form: reflection
sense: 13807616-n
part of speech: noun

13807616-n
type: LexicalConcept
in scheme: en-word.net
definition: (mathematics) a transformation in which the direction of one axis is reversed
ili: i109349
lexfile: noun.relation
part of speech: noun
domain topic: 06009822-n
hypernym: 13807348-n