expansion-n
type: LexicalEntry
canonical form: expansion
sense: 13806578-n
part of speech: noun

13806578-n
type: LexicalConcept
in scheme: en-word.net
definition: a function expressed as a sum or product of terms
example: the expansion of (a+b)^2 is a^2 + 2ab + b^2
ili: i109344
lexfile: noun.relation
part of speech: noun
domain topic: 06009822-n
hypernym: 13806028-n