contrary-n
type: LexicalEntry
canonical form: contrary
sense: 13805633-n
part of speech: noun

13805633-n
type: LexicalConcept
in scheme: en-word.net
definition: a logical relation such that two propositions are contraries if both cannot be true but both can be false
ili: i109341
lexfile: noun.relation
part of speech: noun
hypernym: 13805250-n