relations-n
type: LexicalEntry
canonical form: relations
sense: 13802661-n
part of speech: noun

dealings-n
type: LexicalEntry
canonical form: dealings
sense: 13802661-n
part of speech: noun

13802661-n
type: LexicalConcept
in scheme: en-word.net
definition: mutual dealings or connections or communications among persons or groups
ili: i109327
lexfile: noun.relation
part of speech: noun
hypernym: 00033122-n