population-n
type: LexicalEntry
canonical form: population
sense: 13802016-n
part of speech: noun

13802016-n
type: LexicalConcept
in scheme: en-word.net
definition: the number of inhabitants (either the total number or the number of a particular race or class) in a given place (country or city etc.)
example: people come and go, but the population of this town has remained approximately constant for the past decade
example: the African-American population of Salt Lake City has been increasing
ili: i109324
lexfile: noun.quantity
part of speech: noun
hypernym: 13750609-n