supply-n
type: LexicalEntry
canonical form: supply
sense: 13799556-n
part of speech: noun

13799556-n
type: LexicalConcept
in scheme: en-word.net
definition: an amount of something available for use
ili: i109310
lexfile: noun.quantity
part of speech: noun
hypernym: 13597558-n