run-n
type: LexicalEntry
canonical form: run
sense: 13782269-n
part of speech: noun

13782269-n
type: LexicalConcept
in scheme: en-word.net
definition: the production achieved during a continuous period of operation (of a machine or factory etc.)
example: a daily run of 100,000 gallons of paint
ili: i109188
lexfile: noun.quantity
part of speech: noun
hypernym: 13597558-n