divisor-n
type: LexicalEntry
canonical form: divisor
sense: 13755307-n
part of speech: noun

13755307-n
type: LexicalConcept
in scheme: en-word.net
definition: the number by which a dividend is divided
ili: i109032
lexfile: noun.quantity
part of speech: noun
hypernym: 13603216-n