stone-n
type: LexicalEntry
canonical form: stone
sense: 13742705-n
part of speech: noun

13742705-n
type: LexicalConcept
in scheme: en-word.net
definition: an avoirdupois unit used to measure the weight of a human body; equal to 14 pounds
example: a heavy chap who must have weighed more than twenty stone
ili: i108957
lexfile: noun.quantity
part of speech: noun
domain region: 08879115-n
hypernym: 13738189-n
mero part: 13742201-n