avoirdupois-n
type: LexicalEntry
canonical form: avoirdupois
sense: 13738026-n
part of speech: noun

avoirdupois weight-n
type: LexicalEntry
canonical form: avoirdupois weight
sense: 13738026-n
part of speech: noun

13738026-n
type: LexicalConcept
in scheme: en-word.net
definition: a system of weights based on the 16-ounce pound (or 7,000 grains)
ili: i108929
lexfile: noun.quantity
part of speech: noun
hypernym: 13737860-n
mero part: 13738189-n