cup-n
type: LexicalEntry
canonical form: cup
sense: 13640449-n
part of speech: noun

13640449-n
type: LexicalConcept
in scheme: en-word.net
definition: a United States liquid unit equal to 8 fluid ounces
ili: i108261
lexfile: noun.quantity
part of speech: noun
hypernym: 13636516-n
mero part: 13640309-n