cubic yard-n
type: LexicalEntry
canonical form: cubic yard
sense: 13639357-n
part of speech: noun

yard-n
type: LexicalEntry
canonical form: yard
sense: 13639357-n
part of speech: noun

13639357-n
type: LexicalConcept
in scheme: en-word.net
definition: a unit of volume (as for sand or gravel)
ili: i108253
lexfile: noun.quantity
part of speech: noun
hypernym: 13622065-n