par-n
type: LexicalEntry
canonical form: par
sense: 13617999-n
part of speech: noun

13617999-n
type: LexicalConcept
in scheme: en-word.net
definition: (golf) the standard number of strokes set for each hole on a golf course, or for the entire course
example: a par-5 hole
example: par for this course is 72
ili: i108150
lexfile: noun.quantity
part of speech: noun
domain topic: 00465962-n
hypernym: 13615828-n