score-n
type: LexicalEntry
canonical form: score
sense: 13615828-n
part of speech: noun

13615828-n
type: LexicalConcept
in scheme: en-word.net
definition: a number that expresses the accomplishment of a team or an individual in a game or contest
example: the score was 7 to 0
ili: i108137
lexfile: noun.quantity
part of speech: noun
hypernym: 13603216-n
mero part: 13631405-n