translation-n
type: LexicalEntry
canonical form: translation
sense: 13590186-n
part of speech: noun

13590186-n
type: LexicalConcept
in scheme: en-word.net
definition: (genetics) the process whereby genetic information coded in messenger RNA directs the formation of a specific protein at a ribosome in the cytoplasm
ili: i108015
lexfile: noun.process
part of speech: noun
domain topic: 06085077-n
hypernym: 13547313-n