relaxation-n
type: LexicalEntry
canonical form: relaxation
sense: 13570691-n
part of speech: noun

13570691-n
type: LexicalConcept
in scheme: en-word.net
definition: (physiology) the gradual lengthening of inactive muscle or muscle fibers
ili: i107913
lexfile: noun.process
part of speech: noun
domain topic: 06090110-n
hypernym: 13518338-n