reduction-n
type: LexicalEntry
canonical form: reduction
sense: 13568880-n
part of speech: noun

reducing-n
type: LexicalEntry
canonical form: reducing
sense: 13568880-n
part of speech: noun

13568880-n
type: LexicalConcept
in scheme: en-word.net
definition: any process in which electrons are added to an atom or ion (as by removing oxygen or adding hydrogen); always occurs accompanied by oxidation of the reducing agent
ili: i107904
lexfile: noun.process
part of speech: noun
hypernym: 13468534-n