processing-n
type: LexicalEntry
canonical form: processing
sense: 13562370-n
part of speech: noun

13562370-n
type: LexicalConcept
in scheme: en-word.net
definition: preparing or putting through a prescribed procedure
example: the processing of newly arrived immigrants
example: the processing of ore to obtain minerals
ili: i107868
lexfile: noun.process
part of speech: noun
hypernym: 00029976-n