involution-n
type: LexicalEntry
canonical form: involution
sense: 13523600-n
part of speech: noun

13523600-n
type: LexicalConcept
in scheme: en-word.net
definition: reduction in size of an organ or part (as in the return of the uterus to normal size after childbirth)
ili: i107684
lexfile: noun.process
part of speech: noun
hypernym: 13547313-n