inflation-n
type: LexicalEntry
canonical form: inflation
sense: 13520031-n
part of speech: noun

rising prices-n
type: LexicalEntry
canonical form: rising prices
sense: 13520031-n
part of speech: noun

13520031-n
type: LexicalConcept
in scheme: en-word.net
definition: a general and progressive increase in prices
example: in inflation everything gets more valuable except money
ili: i107665
lexfile: noun.process
part of speech: noun
hypernym: 13492409-n