impregnation-n
type: LexicalEntry
canonical form: impregnation
sense: 13517720-n
part of speech: noun

saturation-n
type: LexicalEntry
canonical form: saturation
sense: 13517720-n
part of speech: noun

13517720-n
type: LexicalConcept
in scheme: en-word.net
definition: the process of totally saturating something with a substance
example: the impregnation of wood with preservative
example: the saturation of cotton with ether
ili: i107655
lexfile: noun.process
part of speech: noun
hypernym: 13556157-n