fold-n
type: LexicalEntry
canonical form: fold
sense: 13504143-n
part of speech: noun

folding-n
type: LexicalEntry
canonical form: folding
sense: 13504143-n
part of speech: noun

13504143-n
type: LexicalConcept
in scheme: en-word.net
definition: a geological process that causes a bend in a stratum of rock
ili: i107587
lexfile: noun.process
part of speech: noun
hypernym: 13508041-n