focalization-n
type: LexicalEntry
canonical form: focalization
sense: 13503984-n
part of speech: noun

focalisation-n
type: LexicalEntry
canonical form: focalisation
sense: 13503984-n
part of speech: noun

13503984-n
type: LexicalConcept
in scheme: en-word.net
definition: the confinement of an infection to a limited area
ili: i107586
lexfile: noun.process
part of speech: noun
hypernym: 13554552-n