extraction-n
type: LexicalEntry
canonical form: extraction
sense: 13499728-n
part of speech: noun

13499728-n
type: LexicalConcept
in scheme: en-word.net
definition: the process of obtaining something from a mixture or compound by chemical or physical or mechanical means
ili: i107565
lexfile: noun.process
part of speech: noun
hypernym: 13540166-n