execution-n
type: LexicalEntry
canonical form: execution
sense: 13498665-n
part of speech: noun

instruction execution-n
type: LexicalEntry
canonical form: instruction execution
sense: 13498665-n
part of speech: noun

13498665-n
type: LexicalConcept
in scheme: en-word.net
definition: (computer science) the process of carrying out an instruction by a computer
ili: i107558
lexfile: noun.process
part of speech: noun
domain topic: 06138021-n
hypernym: 00029976-n