drift-n
type: LexicalEntry
canonical form: drift
sense: 13491096-n
part of speech: noun

13491096-n
type: LexicalConcept
in scheme: en-word.net
definition: a process of linguistic change over a period of time
ili: i107520
lexfile: noun.process
part of speech: noun
hypernym: 13529536-n