domestication-n
type: LexicalEntry
canonical form: domestication
sense: 13490157-n
part of speech: noun

13490157-n
type: LexicalConcept
in scheme: en-word.net
definition: adaptation to intimate association with human beings
ili: i107515
lexfile: noun.process
part of speech: noun
hypernym: 13448251-n