derivation-n
type: LexicalEntry
canonical form: derivation
sense: 13483590-n
part of speech: noun

13483590-n
type: LexicalConcept
in scheme: en-word.net
definition: (descriptive linguistics) the process whereby new words are formed from existing words or bases by affixation
example: ‘singer’ from ‘sing’ or ‘undo’ from ‘do’ are examples of derivations
ili: i107484
lexfile: noun.process
part of speech: noun
domain topic: 06191300-n
hypernym: 13529536-n