denial-n
type: LexicalEntry
canonical form: denial
sense: 13483154-n
part of speech: noun

13483154-n
type: LexicalConcept
in scheme: en-word.net
definition: (psychiatry) a defense mechanism that denies painful thoughts
ili: i107481
lexfile: noun.process
part of speech: noun
domain topic: 06065477-n
hypernym: 13480525-n