assibilation-n
type: LexicalEntry
canonical form: assibilation
sense: 13455579-n
part of speech: noun

13455579-n
type: LexicalConcept
in scheme: en-word.net
definition: the development of a consonant phoneme into a sibilant
ili: i107343
lexfile: noun.process
part of speech: noun
hypernym: 13486023-n