accretion-n
type: LexicalEntry
canonical form: accretion
sense: 13446418-n
part of speech: noun

13446418-n
type: LexicalConcept
in scheme: en-word.net
definition: (biology) growth by addition as by the adhesion of parts or particles
ili: i107292
lexfile: noun.process
part of speech: noun
domain topic: 06047178-n
hypernym: 13518338-n