accretion-n
type: LexicalEntry
canonical form: accretion
sense: 13446240-n
part of speech: noun

13446240-n
type: LexicalConcept
in scheme: en-word.net
definition: (geology) an increase in land resulting from alluvial deposits or waterborne sediment
ili: i107291
lexfile: noun.process
part of speech: noun
domain topic: 06125308-n
hypernym: 13518338-n