balance-n
type: LexicalEntry
canonical form: balance
sense: 13430153-n
part of speech: noun

13430153-n
type: LexicalConcept
in scheme: en-word.net
definition: equality between the totals of the credit and debit sides of an account
ili: i107206
lexfile: noun.possession
part of speech: noun
hypernym: 04755139-n