money-n
type: LexicalEntry
canonical form: money
sense: 13405730-n
part of speech: noun

13405730-n
type: LexicalConcept
in scheme: en-word.net
definition: the most common medium of exchange; functions as legal tender
example: we tried to collect the money he owed us
ili: i107057
lexfile: noun.possession
part of speech: noun
hypernym: 13394134-n